{"text_format":"1","workbook":"xlsx","n_sheets":13,"sheets":["MBTI-Relationships-By-Exp","MBTI-Type-Functions","Comparison","MBTI-Relationships","Socionics-Adapted","Clubs","MBTI-Adapted","Socionics Matrix","Socionics.com","PersonalityPage.com","Cognitive Connections","Grid","Benefit Ring Study"],"not_rendered":{"charts":0,"images":10,"macros":1,"external_links":0,"defined_names":2,"comments":0,"pivot_tables":0},"unopened":[],"bounds":{"document_bytes":16777216,"sheet_cells":100000,"rows_first":2000,"rows_last":500,"rows_between":2000,"halvings":0,"cell_chars":16384,"cell_head_chars":4096},"cells_cut":0,"cells_raw":0,"read":"whole","date_system":"1900"}

{"sheet":"MBTI-Relationships-By-Exp","index":0,"n_rows":90,"n_cols":22,"rows_kept":90,"cut":false,"hidden":false,"merged":[]}
[null,"Hex","A56633","5A66CC","A599CC","5A9933","A599B4","5A99AA","A566AA","5A66AA","A566CC","5A6633","A59933","5A99CC","A59955","5A9955","A56655","5A6655"]
["Color Dec",null,"ENTP","ISFP","ESFJ","INTJ","ENFJ","ISTJ","ESTP","INFP","ESFP","INTP","ENTJ","ISFJ","ESTJ","INFJ","ENFP","ISTP",null,"E","A5"]
[10839603,"ENTP","IDT","NVL","SPP","CST","ADV","CHR","NBR","TRB","EGM","PAL","CPL","ANI","STM","PED","CMP","CTP",null,"I","5A"]
[5924556,"ISFP","NVL","IDT","CST","SPP","CHR","ADV","TRB","NBR","PAL","EGM","ANI","CPL","PED","STM","CTP","CMP"]
[10852812,"ESFJ","SPP","CST","IDT","NVL","NBR","TRB","ADV","CHR","CPL","ANI","EGM","PAL","CMP","CTP","STM","PED",null,"P",66]
[5937459,"INTJ","CST","SPP","NVL","IDT","TRB","NBR","CHR","ADV","ANI","CPL","PAL","EGM","CTP","CMP","PED","STM",null,"J",99]
{"$rows_left_out":85}
{"sheet":"MBTI-Type-Functions","index":1,"n_rows":90,"n_cols":17,"rows_kept":90,"cut":false,"hidden":false,"merged":[]}
[]
[null,null,null,"INTP",null,null,null,"ISTP",null,null,null,"INFP",null,null,null,"ISFP"]
[]
["IDT ",null,"Hero","Introverted Thinking","Ti",null,"Hero","Introverted Thinking","Ti",null,"Hero","Introverted Feeling","Fi",null,"Hero","Introverted Feeling","Fi"]
["PED",null,"Parent","Extraverted Intuition","Ne",null,"Parent","Extraverted Sensing","Se",null,"Parent","Extraverted Intuition","Ne",null,"Parent","Extraverted Sensing","Se"]
["ADV",null,"Child","Introverted Sensing","Si",null,"Child","Introverted Intuition","Ni",null,"Child","Introverted Sensing","Si",null,"Child","Introverted Intuition","Ni"]
{"$rows_left_out":85}
{"sheet":"Comparison","index":2,"n_rows":32,"n_cols":9,"rows_kept":32,"cut":false,"hidden":false,"merged":[[31,1,31,7]]}
[null,null,null,{"$f":"\"B\" & MATCH(C5, 'MBTI-Relationships'!B1:B18, 0)","v":"B6"},null,{"$f":"\"B\" & MATCH(G5, 'MBTI-Relationships'!B1:B18, 0)","v":"B12"}]
[null,null,null,{"$f":"MATCH(D4, INDIRECT(\"'MBTI-Relationships'!\" & D1 & \":R\" & MID(D1, 2, 2)), 0)","v":10},null,{"$f":"MATCH(F4, INDIRECT(\"'MBTI-Relationships'!\" & F1 & \":R\" & MID(F1, 2, 2)), 0)","v":2}]
[null,null,"'MBTI-Type-Functions'!",{"$f":"OFFSET('MBTI-Relationships'!A1,1,D2)","v":"ESFP"},{"$f":"VLOOKUP(C5, 'MBTI-Relationships'!B2:R18, MATCH(G5, 'MBTI-Relationships'!B2:R2, 0), FALSE)","v":"CPL"},{"$f":"OFFSET('MBTI-Relationships'!A1,1,F2)","v":"ENTP"},"'MBTI-Type-Functions'!"]
[null,"INTJ - D14",null,"ANI",{"$f":"TRIM(VLOOKUP(E3, 'MBTI-Relationships'!B21:C36, 2, FALSE))","v":"Complement"},"PAL",null,"INTP - D2"]
[null,null,{"$f":"INDIRECT(C3 & MID(B4, 8, 3))","v":"INTJ"},null,"Cognitive Relationship",null,{"$f":"INDIRECT(G3 & MID(H4, 8, 3))","v":"INTP"}]
[null,null,{"$f":"\"(\"&INDIRECT(\"PersonalityPage.com!B\"&C15)&\")\"","v":"(Scientist)"},null,null,null,{"$f":"\"(\"&INDIRECT(\"PersonalityPage.com!B\"&G15)&\")\"","v":"(Thinker)"}]
{"$rows_left_out":27}
{"sheet":"MBTI-Relationships","index":3,"n_rows":36,"n_cols":18,"rows_kept":36,"cut":false,"hidden":false,"merged":[]}
[]
[null,null,"ENTP","ISFP","ESFJ","INTJ","ENFJ","ISTJ","ESTP","INFP","ESFP","INTP","ENTJ","ISFJ","ESTJ","INFJ","ENFP","ISTP"]
[null,"ENTP","IDT","NVL","SPP","CST","ADV","CHR","NBR","TRB","EGM","PAL","CPL","ANI","STM","PED","CMP","CTP"]
[null,"ISFP","NVL","IDT","CST","SPP","CHR","ADV","TRB","NBR","PAL","EGM","ANI","CPL","PED","STM","CTP","CMP"]
[null,"ESFJ","SPP","CST","IDT","NVL","NBR","TRB","ADV","CHR","CPL","ANI","EGM","PAL","CMP","CTP","STM","PED"]
[null,"INTJ","CST","SPP","NVL","IDT","TRB","NBR","CHR","ADV","ANI","CPL","PAL","EGM","CTP","CMP","PED","STM"]
{"$rows_left_out":31}
{"sheet":"Socionics-Adapted","index":4,"n_rows":36,"n_cols":18,"rows_kept":36,"cut":false,"hidden":false,"merged":[]}
[]
[null,"A\\B","ENTp","ISFj","ESFj","INTp","ENFj","ISTp","ESTp","INFj","ESFp","INTj","ENTj","ISFp","ESTj","INFp","ENFp","ISTj"]
[null,"ENTp","Idn","Cnf","Act","Cnt","Bn<","Sdl","Lkl","Sp>","Ego","Mrr","Qid","Dlt","Bn>","Ill","Cmp","Sp<"]
[null,"ISFj","Cnf","Idn","Cnt","Act","Ill","Bn>","Sp<","Cmp","Mrr","Ego","Dlt","Qid","Sdl","Bn<","Sp>","Lkl"]
[null,"ESFj","Act","Cnt","Idn","Cnf","Cmp","Sp<","Bn<","Ill","Qid","Dlt","Ego","Mrr","Lkl","Sp>","Bn>","Sdl"]
[null,"INTp","Cnt","Act","Cnf","Idn","Sp>","Lkl","Sdl","Bn>","Dlt","Qid","Mrr","Ego","Sp>","Cmp","Ill","Bn<"]
{"$rows_left_out":31}
{"sheet":"Clubs","index":5,"n_rows":28,"n_cols":18,"rows_kept":28,"cut":false,"hidden":false,"merged":[]}
[]
[null,"A\\B","ENTP","INTP","ENTJ","INTJ","ENFJ","INFJ","ENFP","INFP","ESFP","ISFP","ESTP","ISTP","ESTJ","ISTJ","ESFJ","ISFJ"]
[null,"ENTP","IDT","PAL","CPL","CST"]
[null,"INTP","PAL","IDT","CST","CPL"]
[null,"ENTJ","CPL","CST","IDT","PAL"]
[null,"INTJ","CST","CPL","PAL","IDT"]
{"$rows_left_out":23}
{"sheet":"MBTI-Adapted","index":6,"n_rows":70,"n_cols":18,"rows_kept":70,"cut":false,"hidden":false,"merged":[]}
[]
[null,"A\\B","ENTP","ISFJ","ESFJ","INTP","ENFJ","ISTP","ESTP","INFJ","ESFP","INTJ","ENTJ","ISFP","ESTJ","INFP","ENFP","ISTJ"]
[null,"ENTP","IDT","ANI","SPP","PAL","ADV","CTP","NBR","PED","EGM","CST","CPL","NVL","STM","TRB","CMP","CHR"]
[null,"ISFJ","ANI","IDT","PAL","SPP","CTP","ADV","PED","NBR","CST","EGM","NVL","CPL","TRB","STM","CHR","CMP "]
[null,"ESFJ","SPP","PAL","IDT","ANI","NBR","PED","ADV","CTP ","CPL","NVL","EGM","CST","CMP ","CHR","STM","TRB"]
[null,"INTP","PAL","SPP","ANI","IDT","PED","NBR","CTP ","ADV","NVL","CPL","CST","EGM","CHR","CMP ","TRB","STM"]
{"$rows_left_out":65}
{"sheet":"Socionics Matrix","index":7,"n_rows":70,"n_cols":18,"rows_kept":70,"cut":false,"hidden":false,"merged":[]}
[null,null,"ENTP","ISFJ","ESFJ","INTP","ENFJ","ISTP","ESTP","INFJ","ESFP","INTJ","ENTJ","ISFP","ESTJ","INFP","ENFP","ISTJ"]
[null,"A\\B","ENTp","ISFp","ESFj","INTj","ENFj","ISTj","ESTp","INFp","ESFp","INTp","ENTj","ISFj","ESTj","INFj","ENFp","ISTp"]
["ENTP","ENTp","Idn","Dlt","Act","Mrr","Bn>","Sp>","Lkl","Ill","Ego","Cnt","Qid","Cnf","Bn<","Sp<","Cmp","Sdl"]
["ISFJ","ISFp","Dlt","Idn","Mrr","Act","Sp>","Bn>","Ill","Lkl","Cnt","Ego","Cnf","Qid","Sp<","Bn<","Sdl","Cmp"]
["ESFJ","ESFj","Act","Mrr","Idn","Dlt","Cmp","Sdl","Bn<","Sp<","Qid","Cnf","Ego","Cnt","Lkl","Ill","Bn>","Sp>"]
["INTP","INTj","Mrr","Act","Dlt","Idn","Sdl","Cmp","Sp<","Bn<","Cnf","Qid","Cnt","Ego","Ill","Lkl","Sp>","Bn>"]
{"$rows_left_out":65}
{"sheet":"Socionics.com","index":8,"n_rows":16,"n_cols":2,"rows_kept":16,"cut":false,"hidden":false,"merged":[]}
["Identity","These are relations of complete understanding between partners but with an inability to help each other. Identical partners see the world with identical eyes, identically work out received information, come to identical conclusions and have identical problems. Identical partners usually experience sympathy towards each other, trying to support and justify each other. \n\nIdentical relations have a negative side too. Interaction with an Identical partner may quickly become boring unless partners have common interests, working on the same project, or if one partner has sufficient preponderance in knowledge so a teacher and student situation can develop. Usually when partners do not receive any new information from each other they find no use in such interaction and their relations can become neutral. \n\nHowever, periodically even neutral relations come alive for a short period of time. It happens when partners discover new things about each other. If Identical partners feel a mutual attraction to each other their relations can be really loving and caring. \n\nIn order for Identical relations to last, one partner has to take a role of the Dualas if it was a Duality relationship. Usually it happens naturally. If the two are introverts, one often subconsciously attempts to take care of the extrovertedside of things, if the two are thinking types, then one would try to fill the resulting emotional void etc. Different backgrounds and function developments of Identical partners could help in this case, however as with any other relationship there has to be a driving force behind it to keep it going. \n\nThe result of Identical relations is self-development, because these relations can help you to look at your own abilities and disabilities from a different angle. Identical relations can be compared with watching a video of oneself. In conclusion, only these relations can provide a person with correct self-evaluation."]
["Look-a-like","These are relations between equal partners which can be called acquaintances rather than friends. There are no visual obstacles in the development of these relations, partners can talk easily almost about anything. Look-a-like partners do not feel any danger from the other partner. The strong sides of the partners are different in the such a way that almost any conversations between them always fall into the area of the confidence of only one of the partners. Look-a-like partners also have similar problems which makes them feel rather sympathetic towards each other instead of being critical of each other's vulnerabilities. \n\nUnderstanding between partners is usually good. Collaboration between them may be very fruitful especially if partners feel a mutual attraction. When partners lose their feeling of sympathy for each other through anger or any other reason, they can apply pressure to their partner's vulnerabilities. This can sometimes be really unexpected and unpleasant for both partners. \n\nArguments in Look-a-like relations are not common practice. The partners usually try to help each other, or at least feel when their partner requires some form of assistance. However, in many cases the help is not effective enough because partners have similar problems. Look-a-like relations have an average degree of comfort. Partners do not have anything against each other but also nothing for which to struggle. These relations can normally bring a feeling of satisfaction from interaction with an equal and not boring partner. "]
["Contrast","These are relations of an unstable psychological distance. Both partners experience difficulties in establishing and keeping a stable psychological distance between them. The only chance Contrary partners have to get on together well with each other is if they are left alone. In other cases partners usually compete over their strong sides. The reason for this is when somebody else is present, each partner tries to capture the attention of the listener by showing off their strong side. Contrary partners may like some elements of the other partner's behaviour. This often helps the partners to begin a more close relationship. However, when they are in company, their interaction can change dramatically. The introvert partner usually becomes distant, relations lose warm feelings and become formal and cautious. Both partners may start regretting that they became too trustful. \n\nThe extrovert partner normally gets the false impression that the introvert partner is deliberately acting against them. This can bring a great deal of misunderstanding and surprise into these relations, as both partners are convinced that before everything was fine. The introvert partner usually starts suppressing the activity of the extrovert partner and may reproach and criticise them. The extrovert partner in return can behave in the same way. \n\nThe most vulnerable position in these relations belongs to the extrovert partner, who may feel as if they are being betrayed. As a result the extrovert partner could start to worry excessively about their next step so as not to make any mistakes and may therefore become very suspicious. Unfortunately the extrovert partner cannot see that their introvert partner is not as bad as they have begun to imagine. "]
["Duality","These relations are the most favourable and comfortable of all intertype relationsproviding complete psychological compatibility. Dual partners are like two halves of a whole unit. They usually understand each others intentions without any need to say a word. Dual will naturally protect your weak points and appreciate the strong ones without asking for anything in return. Interaction with your Dual allows you to be yourself without the need to adjust to your partner like in other relations. This often saves both partners a lot of energy which they can use for their own interesting activities. Conflicts between Duals are very rare and if there are any, they are normally short lived and solved without pain. Your Dual partner will love you just for what you are and if there is such a thing as true love then it could probably only occur in relations of Duality. \n\nHowever, let's not idealise these relations too much. Although theoretically relations of Duality are the best of the best, practically not everybody who is your Dual will make your dreams come true. The reason for this is that we are usually so twisted up during the course of our lives that our already formed and stable views and attitudes can affect our relationships quite heavily. In fact, younger people have more chance to succeed in the quest for their perfect partner than older people. But the chances are always there. \n\nThere are at least two conditions to be completed for a successful relationship between Duals. Firstly between the partners there has to be at least a minimal mutual attraction. Secondly and most importantly is that the partners are truly striving for the same or similar things. This may include common interests and/or life goals. Partners that are both seriously thinking about building a family are a good example. Logically saying: two halves of the same whole must not repel or move in the different directions, otherwise the whole will break into pieces. Relations of Duality also go through several stages. The first stage sometimes can be really tense. It is like a new engine that requires a \"run in\" first. If relations crumble it normally happens in the first stage. The more stages completed by Duals the more unbreakable their relationship. \n\nHowever, nature has played a little trick on us. It is difficult to notice your Dual partner among all the other types and even easier to pass them by. Usually during first contact extroverts think about their introvert Dual as ordinary and simple, therefore not deserving their personal attention. In return introverts consider their extrovert Dual to be too good for them and therefore unattainable. Both positions usually belong to people who had a lack of Duality interaction during childhood. The magnetic effect of Duality becomes obvious when partners do not see each other for a while. Only after being together for a fair amount of time do the partners start realising how much they need each other. Finally, these relations are most suitable for friendship, marriage and family life. To have a Dual partner is irreplaceable if you have to compete or survive in a socially dangerous environment. "]
["Semi-Duality","These are relations of deficient Duality. Semi-Duality partners usually have no problems in understanding each other or each other's objectives, at least when these objectives are only on paper. When it comes to fulfilling joint plans, partners often fail to co-operate. The extrovertpartner hardly listens to the introvert, concentrating more on the sound of their own voice. However, the introvert partner does not get upset about this and they often seem to find a way to adapt to it. Semi-Duals usually have many topics for conversation and these conversations do not seem to be boring. \n\nSemi-Duals, especially if they are different in gender, can show interest in each other, which is multiplied if in addition they find each other attractive. However, when they feel like they are half way to complete understanding, one of them usually does something, not deliberately of course, that ruins all established harmony putting the partners right back to where they started. This is how incomplete Duality manifests itself. \n\nSemi-Duality partners cannot stay upset with each other for a long time. After partners have calmed down, they attempt to get closer to each other again which unfortunately leads to another stumble. For the observer, these relations may seem really passionate and loving. Relations of Semi-Duality can be compared with the moth and the flame. \n\nIf not taken seriously, these relations can produce a little periodical shaking, keeping the partners \"awake\". Relations of Semi-Duality are also full of contrasts: from being happy to see partner again to sudden disappointment and bewilderment. "]
["Conflict","These are relations of constantly developing conflict. Conflicting relations have the worst compatibility between partners among all other relations. However, it does not seem to be so obvious, especially in the earlier stages of development. Conflicting partners appear rather attractive, interesting and with impressive abilities. \n\nBoth partners are usually convinced that they can coexist and collaborate quite peacefully, but soon it becomes apparent that something is always going wrong, making their relationship problematic. Both partners may mistakenly think that the cause of these problems is minor and easily fixed and that all they need to do is to show a little bit more effort in understanding their partner. \n\nUnfortunately, these attempts to continue pushing their relationship any further will soon provoke an open conflict between the partners. When conflict starts, partners hit each other with arguments exactly in the direction where they can cause maximum pain. In return, the other partner may counterattack even more aggressively. With every conflict these relations become worse and worse. \n\nAlthough Conflicting partners show confidence where their partner is unconfident, they are unable to protect and take care of each other's weak points. This regularly brings disagreement and disappointment into these relations. When after several fruitless attempts to establish a stable relationship the partners give up and break the relationship, they feel saved and released. "]
{"$rows_left_out":11}
{"sheet":"PersonalityPage.com","index":9,"n_rows":16,"n_cols":2,"rows_kept":16,"cut":false,"hidden":false,"merged":[]}
["ISTJ","Duty Fulfiller"]
["ISTP","Mechanic"]
["ISFJ","Nurturer"]
["ISFP","Artist"]
["INFJ","Protector"]
["INFP","Idealist"]
{"$rows_left_out":11}
{"sheet":"Cognitive Connections","index":10,"n_rows":47,"n_cols":16,"rows_kept":47,"cut":false,"hidden":false,"merged":[]}
[]
[null,null,"Identity",null,null,null,"Duality",null,null,null,"Activation",null,null,null,"Mirror"]
[]
[null,"Hero",null,"Hero",null,"Hero",null,"Hero",null,"Hero",null,"Hero",null,"Hero",null,"Hero"]
[null,"Parent",null,"Parent",null,"Parent",null,"Parent",null,"Parent",null,"Parent",null,"Parent",null,"Parent"]
[null,"Child",null,"Child",null,"Child",null,"Child",null,"Child",null,"Child",null,"Child",null,"Child"]
{"$rows_left_out":42}
{"sheet":"Grid","index":11,"n_rows":24,"n_cols":35,"rows_kept":24,"cut":false,"hidden":false,"merged":[]}
[null,null,"H","P","C","A","O","R","D","V",null,null,null,null,"H","P","C","A","O","R","D","V"]
[null,"H",null,null,null,null,null,null,null,null,"H",null,null,"H",null,null,null,null,null,null,null,null,"H",null,null,null,"H","P","C","A","O","R","D","V"]
[null,"P",null,null,null,null,null,null,null,null,"P",null,null,"P",null,null,null,null,null,null,null,null,"P",null,null,"H",null,null,null,null,null,null,null,null,"H"]
[null,"C",null,null,null,null,null,null,null,null,"C",null,null,"C",null,null,null,null,null,null,null,null,"C",null,null,"P",null,null,null,null,null,null,null,null,"P"]
[null,"A",null,null,null,null,null,null,null,null,"A",null,null,"A",null,null,null,null,null,null,null,null,"A",null,null,"C",null,null,null,null,null,null,null,null,"C"]
[null,"O",null,null,null,null,null,null,null,null,"O",null,null,"O",null,null,null,null,null,null,null,null,"O",null,null,"A",null,null,null,null,null,null,null,null,"A"]
{"$rows_left_out":19}
{"sheet":"Benefit Ring Study","index":12,"n_rows":39,"n_cols":18,"rows_kept":39,"cut":false,"hidden":false,"merged":[]}
[]
[]
[]
[]
[]
[]
{"$rows_left_out":33}